Gönderen Konu: [Çözüldü]Marlin FM kurulum sorunu (varka-bzr)  (Okunma sayısı 2585 defa)

0 Üye ve 1 Ziyaretçi konuyu incelemekte.

Çevrimdışı krwlng

  • Newbie
  • *
  • İleti: 54
[Çözüldü]Marlin FM kurulum sorunu (varka-bzr)
« : 06 Nisan 2012 - 16:29:15 »
Merhabaa, bugün denemek amaçlı marlin dosya yöneticisini kurmayı denedim, malum marlin AUR deplarında bulunuyor, yaourt ile kuruluma başladım fakat iş varka-bzr paketini kurmaya gelince derleme hatası verip kurulumu kesiyor, aşağıdaki kısma kadar sorun yok fakat ondan sonra kurulumu kesiyor.


Kod: [Seç]
-- checking for a minimum Vala version of 0.12.0
--   found Vala, version 0.14.2
-- Configuring done
-- Generating done
-- Build files have been written to: /tmp/yaourt-tmp-krwlng/aur-varka-bzr/src/varka-build/build
[  6%] Generating Logger.c, IconFactory.c, GtkPatch/AboutDialog.c, Widgets/WrapLabel.c, Widgets/AboutDialog.c, Widgets/ModeButton.c, Widgets/CollapsiblePaned.c, Widgets/StaticNotebook.c, Widgets/AppMenu.c, Widgets/ToolButtonWithMenu.c, Widgets/ImgEventBox.c, Widgets/XsEntry.c, config.vapi, varka.vapi, varka.h, varka_internal.h
Scanning dependencies of target varka
[ 12%] Building C object lib/CMakeFiles/varka.dir/GtkPatch/gtkpatch-utils.c.o
[ 18%] Building C object lib/CMakeFiles/varka.dir/Widgets/widgets-utils.c.o
/tmp/yaourt-tmp-krwlng/aur-varka-bzr/src/varka-build/lib/Widgets/widgets-utils.c: In function 'close_cb':
/tmp/yaourt-tmp-krwlng/aur-varka-bzr/src/varka-build/lib/Widgets/widgets-utils.c:36:35: UYARI: uyumsuz gösterici türünde ilklendirme [enabled by default]
/tmp/yaourt-tmp-krwlng/aur-varka-bzr/src/varka-build/lib/Widgets/widgets-utils.c: In function 'varka_widgets_show_about_dialog':
/tmp/yaourt-tmp-krwlng/aur-varka-bzr/src/varka-build/lib/Widgets/widgets-utils.c:70:16: UYARI: atama bir tür dönüşümü olmaksızın tamsayıdan gösterici yapıyor [enabled by default]
[ 18%] Generating Logger.c, IconFactory.c, GtkPatch/AboutDialog.c, Widgets/WrapLabel.c, Widgets/AboutDialog.c, Widgets/ModeButton.c, Widgets/CollapsiblePaned.c, Widgets/StaticNotebook.c, Widgets/AppMenu.c, Widgets/ToolButtonWithMenu.c, Widgets/ImgEventBox.c, Widgets/XsEntry.c, config.vapi, varka.vapi, varka.h, varka_internal.h
[ 25%] Building C object lib/CMakeFiles/varka.dir/Logger.c.o
[ 31%] Building C object lib/CMakeFiles/varka.dir/IconFactory.c.o
/tmp/yaourt-tmp-krwlng/aur-varka-bzr/src/varka-build/build/lib/IconFactory.c:31:20: UYARI: makro isminden sonra boşluk gerekir [enabled by default]
/tmp/yaourt-tmp-krwlng/aur-varka-bzr/src/varka-build/build/lib/IconFactory.c:32:15: UYARI: makro isminden sonra boşluk gerekir [enabled by default]
/tmp/yaourt-tmp-krwlng/aur-varka-bzr/src/varka-build/build/lib/IconFactory.c:33:15: UYARI: makro isminden sonra boşluk gerekir [enabled by default]
/tmp/yaourt-tmp-krwlng/aur-varka-bzr/src/varka-build/build/lib/IconFactory.c:33:0: UYARI: "VARKA_" yeniden tanımlanmış [enabled by default]
/tmp/yaourt-tmp-krwlng/aur-varka-bzr/src/varka-build/build/lib/IconFactory.c:32:0: bilgi: burası evvelki tanımın yapıldığı yer
/tmp/yaourt-tmp-krwlng/aur-varka-bzr/src/varka-build/build/lib/IconFactory.c:34:18: UYARI: makro isminden sonra boşluk gerekir [enabled by default]
/tmp/yaourt-tmp-krwlng/aur-varka-bzr/src/varka-build/build/lib/IconFactory.c:35:18: UYARI: makro isminden sonra boşluk gerekir [enabled by default]
/tmp/yaourt-tmp-krwlng/aur-varka-bzr/src/varka-build/build/lib/IconFactory.c:35:0: UYARI: "VARKA_IS_" yeniden tanımlanmış [enabled by default]
/tmp/yaourt-tmp-krwlng/aur-varka-bzr/src/varka-build/build/lib/IconFactory.c:34:0: bilgi: burası evvelki tanımın yapıldığı yer
/tmp/yaourt-tmp-krwlng/aur-varka-bzr/src/varka-build/build/lib/IconFactory.c:36:15: UYARI: makro isminden sonra boşluk gerekir [enabled by default]
/tmp/yaourt-tmp-krwlng/aur-varka-bzr/src/varka-build/build/lib/IconFactory.c:36:0: UYARI: "VARKA_" yeniden tanımlanmış [enabled by default]
/tmp/yaourt-tmp-krwlng/aur-varka-bzr/src/varka-build/build/lib/IconFactory.c:33:0: bilgi: burası evvelki tanımın yapıldığı yer
/tmp/yaourt-tmp-krwlng/aur-varka-bzr/src/varka-build/build/lib/IconFactory.c:64:15: UYARI: makro isminden sonra boşluk gerekir [enabled by default]
/tmp/yaourt-tmp-krwlng/aur-varka-bzr/src/varka-build/build/lib/IconFactory.c:64:0: UYARI: "VARKA_" yeniden tanımlanmış [enabled by default]
/tmp/yaourt-tmp-krwlng/aur-varka-bzr/src/varka-build/build/lib/IconFactory.c:36:0: bilgi: burası evvelki tanımın yapıldığı yer
/tmp/yaourt-tmp-krwlng/aur-varka-bzr/src/varka-build/build/lib/IconFactory.c:66:2: hata: programda serseri '304'
/tmp/yaourt-tmp-krwlng/aur-varka-bzr/src/varka-build/build/lib/IconFactory.c:66:2: hata: programda serseri '260'
/tmp/yaourt-tmp-krwlng/aur-varka-bzr/src/varka-build/build/lib/IconFactory.c:66:2: hata: expected ',' or '}' before '(' token
/tmp/yaourt-tmp-krwlng/aur-varka-bzr/src/varka-build/build/lib/IconFactory.c:66:2: hata: programda serseri '304'
/tmp/yaourt-tmp-krwlng/aur-varka-bzr/src/varka-build/build/lib/IconFactory.c:66:2: hata: programda serseri '260'
/tmp/yaourt-tmp-krwlng/aur-varka-bzr/src/varka-build/build/lib/IconFactory.c:66:2: hata: programda serseri '304'
/tmp/yaourt-tmp-krwlng/aur-varka-bzr/src/varka-build/build/lib/IconFactory.c:66:2: hata: programda serseri '260'
/tmp/yaourt-tmp-krwlng/aur-varka-bzr/src/varka-build/build/lib/IconFactory.c:66:2: hata: programda serseri '304'
/tmp/yaourt-tmp-krwlng/aur-varka-bzr/src/varka-build/build/lib/IconFactory.c:66:2: hata: programda serseri '260'
/tmp/yaourt-tmp-krwlng/aur-varka-bzr/src/varka-build/build/lib/IconFactory.c: In function 'varka_icon_factory_new':
/tmp/yaourt-tmp-krwlng/aur-varka-bzr/src/varka-build/build/lib/IconFactory.c:94:2: hata: programda serseri '304'
/tmp/yaourt-tmp-krwlng/aur-varka-bzr/src/varka-build/build/lib/IconFactory.c:94:2: hata: programda serseri '260'
/tmp/yaourt-tmp-krwlng/aur-varka-bzr/src/varka-build/build/lib/IconFactory.c:94:2: hata: programda serseri '304'
/tmp/yaourt-tmp-krwlng/aur-varka-bzr/src/varka-build/build/lib/IconFactory.c:94:2: hata: programda serseri '260'
/tmp/yaourt-tmp-krwlng/aur-varka-bzr/src/varka-build/build/lib/IconFactory.c:94:52: hata: expected ')' before 'CON_FACTORY'
/tmp/yaourt-tmp-krwlng/aur-varka-bzr/src/varka-build/build/lib/IconFactory.c: In function 'varka_icon_factory_load_symbolic_icon':
/tmp/yaourt-tmp-krwlng/aur-varka-bzr/src/varka-build/build/lib/IconFactory.c:143:2: hata: programda serseri '304'
/tmp/yaourt-tmp-krwlng/aur-varka-bzr/src/varka-build/build/lib/IconFactory.c:143:2: hata: programda serseri '260'
/tmp/yaourt-tmp-krwlng/aur-varka-bzr/src/varka-build/build/lib/IconFactory.c:143:51: hata: 'G_' undeclared (first use in this function)
/tmp/yaourt-tmp-krwlng/aur-varka-bzr/src/varka-build/build/lib/IconFactory.c:143:51: bilgi: each undeclared identifier is reported only once for each function it appears in
/tmp/yaourt-tmp-krwlng/aur-varka-bzr/src/varka-build/build/lib/IconFactory.c:143:55: hata: expected ')' before 'CON'
/tmp/yaourt-tmp-krwlng/aur-varka-bzr/src/varka-build/build/lib/IconFactory.c:143:55: hata: 'gtk_icon_theme_lookup_by_gicon' işlevi için çok az argüman belirtildi
In file included from /usr/include/gtk-3.0/gtk/gtk.h:120:0,
                 from /tmp/yaourt-tmp-krwlng/aur-varka-bzr/src/varka-build/build/lib/IconFactory.c:23:
/usr/include/gtk-3.0/gtk/gtkicontheme.h:175:15: bilgi: declared here
/tmp/yaourt-tmp-krwlng/aur-varka-bzr/src/varka-build/build/lib/IconFactory.c: In function 'varka_icon_factory_instance_init':
/tmp/yaourt-tmp-krwlng/aur-varka-bzr/src/varka-build/build/lib/IconFactory.c:197:2: hata: programda serseri '304'
/tmp/yaourt-tmp-krwlng/aur-varka-bzr/src/varka-build/build/lib/IconFactory.c:197:2: hata: programda serseri '260'
/tmp/yaourt-tmp-krwlng/aur-varka-bzr/src/varka-build/build/lib/IconFactory.c:197:15: hata: 'o' undeclared (first use in this function)
/tmp/yaourt-tmp-krwlng/aur-varka-bzr/src/varka-build/build/lib/IconFactory.c:197:15: hata: çağrılan nesne '0' bir işlev değil
/tmp/yaourt-tmp-krwlng/aur-varka-bzr/src/varka-build/build/lib/IconFactory.c:197:2: hata: programda serseri '304'
/tmp/yaourt-tmp-krwlng/aur-varka-bzr/src/varka-build/build/lib/IconFactory.c:197:2: hata: programda serseri '260'
/tmp/yaourt-tmp-krwlng/aur-varka-bzr/src/varka-build/build/lib/IconFactory.c:197:2: hata: programda serseri '304'
/tmp/yaourt-tmp-krwlng/aur-varka-bzr/src/varka-build/build/lib/IconFactory.c:197:2: hata: programda serseri '260'
/tmp/yaourt-tmp-krwlng/aur-varka-bzr/src/varka-build/build/lib/IconFactory.c:197:15: hata: expected ')' before 'CON_FACTORY'
/tmp/yaourt-tmp-krwlng/aur-varka-bzr/src/varka-build/build/lib/IconFactory.c:197:15: hata: programda serseri '304'
/tmp/yaourt-tmp-krwlng/aur-varka-bzr/src/varka-build/build/lib/IconFactory.c:197:15: hata: programda serseri '260'
/tmp/yaourt-tmp-krwlng/aur-varka-bzr/src/varka-build/build/lib/IconFactory.c:197:23: hata: expected ';' before 'CON_FACTORY_GET_PRIVATE'
/tmp/yaourt-tmp-krwlng/aur-varka-bzr/src/varka-build/build/lib/IconFactory.c: In function 'varka_icon_factory_finalize':
/tmp/yaourt-tmp-krwlng/aur-varka-bzr/src/varka-build/build/lib/IconFactory.c:203:2: hata: programda serseri '304'
/tmp/yaourt-tmp-krwlng/aur-varka-bzr/src/varka-build/build/lib/IconFactory.c:203:2: hata: programda serseri '260'
/tmp/yaourt-tmp-krwlng/aur-varka-bzr/src/varka-build/build/lib/IconFactory.c:203:9: hata: 'o' undeclared (first use in this function)
/tmp/yaourt-tmp-krwlng/aur-varka-bzr/src/varka-build/build/lib/IconFactory.c:203:9: hata: çağrılan nesne '0' bir işlev değil
/tmp/yaourt-tmp-krwlng/aur-varka-bzr/src/varka-build/build/lib/IconFactory.c:203:2: hata: programda serseri '304'
/tmp/yaourt-tmp-krwlng/aur-varka-bzr/src/varka-build/build/lib/IconFactory.c:203:2: hata: programda serseri '260'
/tmp/yaourt-tmp-krwlng/aur-varka-bzr/src/varka-build/build/lib/IconFactory.c:203:2: hata: programda serseri '304'
/tmp/yaourt-tmp-krwlng/aur-varka-bzr/src/varka-build/build/lib/IconFactory.c:203:2: hata: programda serseri '260'
/tmp/yaourt-tmp-krwlng/aur-varka-bzr/src/varka-build/build/lib/IconFactory.c:203:9: hata: expected ')' before 'CON_FACTORY'
/tmp/yaourt-tmp-krwlng/aur-varka-bzr/src/varka-build/build/lib/IconFactory.c:203:9: hata: programda serseri '304'
/tmp/yaourt-tmp-krwlng/aur-varka-bzr/src/varka-build/build/lib/IconFactory.c:203:9: hata: programda serseri '260'
/tmp/yaourt-tmp-krwlng/aur-varka-bzr/src/varka-build/build/lib/IconFactory.c:203:17: hata: expected ';' before 'CON_FACTORY'
make[2]: *** [lib/CMakeFiles/varka.dir/IconFactory.c.o] Hata 1
make[1]: *** [lib/CMakeFiles/varka.dir/all] Hata 2
make: *** [all] Hata 2
==> HATA: build() içinde bir hata oluştu.
    Çıkılıyor...
==> ERROR: Makepkg was unable to build varka-bzr.
==> Restart building varka-bzr ? [y/N]
bir fikri olan var mı?
« Son Düzenleme: 01 Ocak 1970 - 02:00:00 Gönderen: cumali »

Çevrimdışı if*

  • İleti: 48
RE: Marlin FM kurulum sorunu (varka-bzr)
« Yanıtla #1 : 06 Nisan 2012 - 22:08:38 »
@krwlng, paket olarak(tarball) indirip,
Kod: [Seç]
LC_ALL=C makepkg -s
olarak dener misiniz?
« Son Düzenleme: 26 Nisan 2018 - 09:25:28 Gönderen: Sistem »

Çevrimdışı decent

  • Administrator
  • *****
  • İleti: 1.092
    • ARCHER KIM
  • Dağıtım: Arch Linux <:> Ubuntu
  • Sürüm: *
  • Ekran Kartı: Nvidia / ATI
RE: Marlin FM kurulum sorunu (varka-bzr)
« Yanıtla #2 : 06 Nisan 2012 - 22:47:06 »
@if*,

Bu yöntemin burada da işe yarayacağı hiç aklıma gelmemişti.



Bendeki son durum;

** varka-bzr paketi kuruluyor,

** marlin-bzr paketinde derlemenin son kısmında hata veriyor.


Kod: [Seç]
decent ~  $  packer -S marlin-bzr

Aur Targets    (1): marlin-bzr

Proceed with installation? [Y/n]

Edit marlin-bzr PKGBUILD with $EDITOR? [Y/n]

Edit marlin-bzr.install with $EDITOR? [Y/n] n
==> Son bzr sürümü belirleniyor...
You have not informed bzr of your Launchpad ID, and you must do this to
write to Launchpad or access private data.  See "bzr help launchpad-login".
  -> Değişiklik numarası olarak 818 bulundu
==> marlin-bzr 818-1 (Cum Nis  6 22:42:09 EEST 2012) paketi oluşturuluyor
==> Bağımlılıklar denetleniyor...
==> Derleme bağımlılıkları denetleniyor...
==> Kaynak kodları alınıyor...
==> Kaynak Kodları Açılıyor...
==> Mevcut pkg/ dizini kaldırılıyor ...
==> build() işlemine başlanıyor...
==> Connecting to Bazaar server....
You have not informed bzr of your Launchpad ID, and you must do this to
write to Launchpad or access private data.  See "bzr help launchpad-login".
http://bazaar.launchpad.net/~marlin-devs/marlin/pangolin is permanently redirected to http://bazaar.launchpad.net/~marlin-devs/marlin/pangolin/changes
You have not informed bzr of your Launchpad ID, and you must do this to
write to Launchpad or access private data.  See "bzr help launchpad-login".
No revisions or tags to pull.                                                  
==> The local files are updated.
==> BZR checkout done or server timeout
==> Starting make...
-- The C compiler identification is GNU
-- The CXX compiler identification is GNU
-- Check for working C compiler: /usr/bin/gcc
-- Check for working C compiler: /usr/bin/gcc -- works
-- Detecting C compiler ABI info
-- Detecting C compiler ABI info - done
-- Check for working CXX compiler: /usr/bin/c++
-- Check for working CXX compiler: /usr/bin/c++ -- works
-- Detecting CXX compiler ABI info
-- Detecting CXX compiler ABI info - done
-- Found Vala: /usr/bin/valac
-- checking for a minimum Vala version of 0.11.3
--   found Vala, version 0.16.0
-- checking for modules 'varka>=0.1;glib-2.0>=2.29.0;gthread-2.0;gio-2.0;gio-unix-2.0;pango>=1.1.2;gtk+-3.0>=3.0.3;gail-3.0;gee-1.0;sqlite3;dbus-glib-1;libnotify>=0.7.2'
--   found varka, version 0.1
--   found glib-2.0, version 2.32.0
--   found gthread-2.0, version 2.32.0
--   found gio-2.0, version 2.32.0
--   found gio-unix-2.0, version 2.32.0
--   found pango, version 1.30.0
--   found gtk+-3.0, version 3.4.0
--   found gail-3.0, version 3.4.0
--   found gee-1.0, version 0.6.4
--   found sqlite3, version 3.7.11
--   found dbus-glib-1, version 0.98
--   found libnotify, version 0.7.5
-- checking for module 'unity>=4.0.0'
--   package 'unity>=4.0.0' not found
-- checking for a minimum Vala version of 0.11.3
--   found Vala, version 0.16.0
-- checking for a minimum Vala version of 0.12.0
--   found Vala, version 0.16.0
-- checking for a minimum Vala version of 0.12.0
--   found Vala, version 0.16.0
-- checking for a minimum Vala version of 0.12.0
--   found Vala, version 0.16.0
-- checking for a minimum Vala version of 0.12.0
--   found Vala, version 0.16.0
-- GSettings schemas will be installed locally.
-- GSettings shemas will be compiled.
-- GSettings schemas will be installed into /usr/share/glib-2.0/schemas/
-- GSettings schemas will be installed into /usr/share/glib-2.0/schemas/
-- Configuring done
-- Generating done
-- Build files have been written to: /tmp/packerbuild-1000/marlin-bzr/marlin-bzr/src/marlin-build/build
/tmp/packerbuild-1000/marlin-bzr/marlin-bzr/PKGBUILD: line 53: -DCMAKE_EXE_LINKER_FLAGS=-march=x86-64 -mtune=generic -O2 -pipe -fstack-protector --param=ssp-buffer-size=4 -D_FORTIFY_SOURCE=2 -lm: komut yok
==> HATA: build() içinde bir hata oluştu.
    Çıkılıyor...
The build failed.
decent ~  $
« Son Düzenleme: 01 Ocak 1970 - 02:00:00 Gönderen: Anonymous »

Çevrimdışı cumali

  • Administrator
  • *****
  • İleti: 2.228
RE: Marlin FM kurulum sorunu (varka-bzr)
« Yanıtla #3 : 06 Nisan 2012 - 22:49:07 »
Bridge üzerinde sorunsuz kuruldu.
« Son Düzenleme: 01 Ocak 1970 - 02:00:00 Gönderen: Anonymous »

Çevrimdışı if*

  • İleti: 48
RE: Marlin FM kurulum sorunu (varka-bzr)
« Yanıtla #4 : 07 Nisan 2012 - 00:28:16 »
@decent, Türkçe karakterden dolayı sorun çıkartabileceğini düşündüm. "-lm" parametresini sen mi ekledin=
@cumali,
Kod: [Seç]
cat /etc/makepkg.conf
çıktısına bakabilir miyim?
« Son Düzenleme: 26 Nisan 2018 - 09:24:51 Gönderen: Sistem »

Çevrimdışı cumali

  • Administrator
  • *****
  • İleti: 2.228
RE: Marlin FM kurulum sorunu (varka-bzr)
« Yanıtla #5 : 07 Nisan 2012 - 00:35:00 »
Tabi,


Kod: [Seç]
[cuma@cuma ~]$ cat /etc/makepkg.conf
#
# /etc/makepkg.conf
#

#########################################################################
# SOURCE ACQUISITION
#########################################################################
#
#-- The download utilities that makepkg should use to acquire sources
#  Format: 'protocol::agent'
DLAGENTS=('ftp::/usr/bin/curl -fC - --ftp-pasv --retry 3 --retry-delay 3 -o %o %u'
          'http::/usr/bin/curl -fLC - --retry 3 --retry-delay 3 -o %o %u'
          'https::/usr/bin/curl -fLC - --retry 3 --retry-delay 3 -o %o %u'
          'rsync::/usr/bin/rsync -z %u %o'
          'scp::/usr/bin/scp -C %u %o')

# Other common tools:
# /usr/bin/snarf
# /usr/bin/lftpget -c
# /usr/bin/wget

#########################################################################
# ARCHITECTURE, COMPILE FLAGS
#########################################################################
#
CARCH="i686"
CHOST="i686-pc-linux-gnu"

#-- Compiler and Linker Flags
# -march (or -mcpu) builds exclusively for an architecture
# -mtune optimizes for an architecture, but builds for whole processor family
CFLAGS="-march=i686 -mtune=generic -O2 -pipe -fstack-protector --param=ssp-buffer-size=4 -D_FORTIFY_SOURCE=2"
CXXFLAGS="-march=i686 -mtune=generic -O2 -pipe -fstack-protector --param=ssp-buffer-size=4 -D_FORTIFY_SOURCE=2"
LDFLAGS="-Wl,-O1,--sort-common,--as-needed,-z,relro,--hash-style=gnu"
#-- Make Flags: change this for DistCC/SMP systems
#MAKEFLAGS="-j2"

#########################################################################
# BUILD ENVIRONMENT
#########################################################################
#
# Defaults: BUILDENV=(fakeroot !distcc color !ccache check !sign)
#  A negated environment option will do the opposite of the comments below.
#
#-- fakeroot: Allow building packages as a non-root user
#-- distcc:   Use the Distributed C/C++/ObjC compiler
#-- color:    Colorize output messages
#-- ccache:   Use ccache to cache compilation
#-- check:    Run the check() function if present in the PKGBUILD
#-- sign:     Generate PGP signature file
#
BUILDENV=(fakeroot !distcc color !ccache check !sign)
#
#-- If using DistCC, your MAKEFLAGS will also need modification. In addition,
#-- specify a space-delimited list of hosts running in the DistCC cluster.
#DISTCC_HOSTS=""
#
#-- Specify a directory for package building.
#BUILDDIR=/tmp/makepkg

#########################################################################
# GLOBAL PACKAGE OPTIONS
#   These are default values for the options=() settings
#########################################################################
#
# Default: OPTIONS=(strip docs libtool emptydirs zipman purge !upx)
#  A negated option will do the opposite of the comments below.
#
#-- strip:     Strip symbols from binaries/libraries
#-- docs:      Save doc directories specified by DOC_DIRS
#-- libtool:   Leave libtool (.la) files in packages
#-- emptydirs: Leave empty directories in packages
#-- zipman:    Compress manual (man and info) pages in MAN_DIRS with gzip
#-- purge:     Remove files specified by PURGE_TARGETS
#-- upx:       Compress binary executable files using UPX
#
OPTIONS=(strip docs libtool emptydirs zipman purge !upx)

#-- File integrity checks to use. Valid: md5, sha1, sha256, sha384, sha512
INTEGRITY_CHECK=(md5)
#-- Options to be used when stripping binaries. See `man strip' for details.
STRIP_BINARIES="--strip-all"
#-- Options to be used when stripping shared libraries. See `man strip' for details.
STRIP_SHARED="--strip-unneeded"
#-- Options to be used when stripping static libraries. See `man strip' for details.
STRIP_STATIC="--strip-debug"
#-- Manual (man and info) directories to compress (if zipman is specified)
MAN_DIRS=({usr{,/local}{,/share},opt/*}/{man,info})
#-- Doc directories to remove (if !docs is specified)
DOC_DIRS=(usr/{,local/}{,share/}{doc,gtk-doc} opt/*/{doc,gtk-doc})
#-- Files to be removed from all packages (if purge is specified)
PURGE_TARGETS=(usr/{,share}/info/dir .packlist *.pod)

#########################################################################
# PACKAGE OUTPUT
#########################################################################
#
# Default: put built package and cached source in build directory
#
#-- Destination: specify a fixed directory where all packages will be placed
#PKGDEST=/home/packages
#-- Source cache: specify a fixed directory where source files will be cached
#SRCDEST=/home/sources
#-- Source packages: specify a fixed directory where all src packages will be placed
#SRCPKGDEST=/home/srcpackages
#-- Packager: name/email of the person or organization building packages
#PACKAGER="John Doe <john@doe.com>"
#-- Specify a key to use for package signing
#GPGKEY=""

#########################################################################
# EXTENSION DEFAULTS
#########################################################################
#
# WARNING: Do NOT modify these variables unless you know what you are
#          doing.
#
PKGEXT='.pkg.tar.xz'
SRCEXT='.src.tar.gz'

# vim: set ft=sh ts=2 sw=2 et:
[cuma@cuma ~]$
« Son Düzenleme: 01 Ocak 1970 - 02:00:00 Gönderen: Anonymous »

Çevrimdışı if*

  • İleti: 48
RE: Marlin FM kurulum sorunu (varka-bzr)
« Yanıtla #6 : 07 Nisan 2012 - 01:10:38 »
Teşekkür ederim @cumali.



@decent, /etc/mapkepkg.conf içerisindeki CFLAGS seçeneklerinden "-lm" değişkenini silip dener misin?
« Son Düzenleme: 01 Ocak 1970 - 02:00:00 Gönderen: Anonymous »

Çevrimdışı krwlng

  • Newbie
  • *
  • İleti: 54
RE: Marlin FM kurulum sorunu (varka-bzr)
« Yanıtla #7 : 07 Nisan 2012 - 22:48:32 »
@if
Kod: [Seç]
LC_ALL=C makepkg -s
komutu ile AUR sayfasından indirdiğim varka-bzr tarball üzerinde derleme yaptım, sonrasında marlin kurmayı tekrar denedim fakat varka-bzr paketini tekrar kurmaya çalışıyor ve yine aynı hatayı veriyor, varka-bzr tarball ile tekrar derleme yapmak istediğim zaman ise zaten derlemişsiniz -f kullanıp üzerine yazabilirsiniz diyor. marlini tarball ile belirttiğiniz komutla kurmak istediğimde ise
Kod: [Seç]
[krwlng@Arch marlin-bzr]$ LC_ALL=C makepkg -s
==> Determining latest bzr revision...
You have not informed bzr of your Launchpad ID, and you must do this to
write to Launchpad or access private data.  See "bzr help launchpad-login".
  -> Version found: 798
==> Making package: marlin-bzr 798-1 (Sat Apr  7 22:49:13 EEST 2012)
==> Checking runtime dependencies...
==> Installing missing dependencies...
error: target not found: varka-bzr
==> ERROR: 'pacman' failed to install missing dependencies.
hatasını alıyorum.
« Son Düzenleme: 01 Ocak 1970 - 02:00:00 Gönderen: Anonymous »

Çevrimdışı tarakbumba

  • Newbie
  • *
  • İleti: 252
RE: Marlin FM kurulum sorunu (varka-bzr)
« Yanıtla #8 : 07 Nisan 2012 - 23:09:17 »
Öncelikle varka-bzr paketi pacman -U --asdeps varka-bzr şeklinde kurun. Daha sonra marlin paketini derlemeyi ve kurmayı deneyin.
« Son Düzenleme: 01 Ocak 1970 - 02:00:00 Gönderen: Anonymous »

Çevrimdışı krwlng

  • Newbie
  • *
  • İleti: 54
RE: Marlin FM kurulum sorunu (varka-bzr)
« Yanıtla #9 : 07 Nisan 2012 - 23:19:59 »
"hata: 'varka-bzr': paket bulunamadı veya okunamadı" hatasını alıyorum. varka-bzr paketi pacman depolarında yoktu sanırım, AUR da bulabilmiştim o da sorun çıkardı.
« Son Düzenleme: 01 Ocak 1970 - 02:00:00 Gönderen: krwlng »

Çevrimdışı tarakbumba

  • Newbie
  • *
  • İleti: 252
Cvp: Marlin FM kurulum sorunu (varka-bzr)
« Yanıtla #10 : 08 Nisan 2012 - 00:55:28 »
Depolarda olmadığını, Aur' dan derlediğini zaten yazmışsın. Aur'dan derlediğin paketin bulunduğu dizinde o komutu vermen gerekir. Bu dizinin yerini /etc/makepkg.conf içerisinde bulabilirsin.
« Son Düzenleme: 01 Ocak 1970 - 02:00:00 Gönderen: Anonymous »

Çevrimdışı krwlng

  • Newbie
  • *
  • İleti: 54
Cvp: Marlin FM kurulum sorunu (varka-bzr)
« Yanıtla #11 : 08 Nisan 2012 - 12:55:37 »
Ben göremedim tam olarak nerede olduğunu, atladığım bir yer olabilir diye makepkg.conf paylaşıyorum.


Kod: [Seç]
#
# /etc/makepkg.conf
#

#########################################################################
# SOURCE ACQUISITION
#########################################################################
#
#-- The download utilities that makepkg should use to acquire sources
#  Format: 'protocol::agent'
DLAGENTS=('ftp::/usr/bin/curl -fC - --ftp-pasv --retry 3 --retry-delay 3 -o %o %u'
          'http::/usr/bin/curl -fLC - --retry 3 --retry-delay 3 -o %o %u'
          'https::/usr/bin/curl -fLC - --retry 3 --retry-delay 3 -o %o %u'
          'rsync::/usr/bin/rsync -z %u %o'
          'scp::/usr/bin/scp -C %u %o')

# Other common tools:
# /usr/bin/snarf
# /usr/bin/lftpget -c
# /usr/bin/wget

#########################################################################
# ARCHITECTURE, COMPILE FLAGS
#########################################################################
#
CARCH="x86_64"
CHOST="x86_64-unknown-linux-gnu"

#-- Compiler and Linker Flags
# -march (or -mcpu) builds exclusively for an architecture
# -mtune optimizes for an architecture, but builds for whole processor family
CFLAGS="-march=x86-64 -mtune=generic -O2 -pipe -fstack-protector --param=ssp-buffer-size=4 -D_FORTIFY_SOURCE=2"
CXXFLAGS="-march=x86-64 -mtune=generic -O2 -pipe -fstack-protector --param=ssp-buffer-size=4 -D_FORTIFY_SOURCE=2"
LDFLAGS="-Wl,-O1,--sort-common,--as-needed,-z,relro,--hash-style=gnu"
#-- Make Flags: change this for DistCC/SMP systems
#MAKEFLAGS="-j2"

#########################################################################
# BUILD ENVIRONMENT
#########################################################################
#
# Defaults: BUILDENV=(fakeroot !distcc color !ccache check !sign)
#  A negated environment option will do the opposite of the comments below.
#
#-- fakeroot: Allow building packages as a non-root user
#-- distcc:   Use the Distributed C/C++/ObjC compiler
#-- color:    Colorize output messages
#-- ccache:   Use ccache to cache compilation
#-- check:    Run the check() function if present in the PKGBUILD
#-- sign:     Generate PGP signature file
#
BUILDENV=(fakeroot !distcc color !ccache check !sign)
#
#-- If using DistCC, your MAKEFLAGS will also need modification. In addition,
#-- specify a space-delimited list of hosts running in the DistCC cluster.
#DISTCC_HOSTS=""
#
#-- Specify a directory for package building.
#BUILDDIR=/tmp/makepkg

#########################################################################
# GLOBAL PACKAGE OPTIONS
#   These are default values for the options=() settings
#########################################################################
#
# Default: OPTIONS=(strip docs libtool emptydirs zipman purge !upx)
#  A negated option will do the opposite of the comments below.
#
#-- strip:     Strip symbols from binaries/libraries
#-- docs:      Save doc directories specified by DOC_DIRS
#-- libtool:   Leave libtool (.la) files in packages
#-- emptydirs: Leave empty directories in packages
#-- zipman:    Compress manual (man and info) pages in MAN_DIRS with gzip
#-- purge:     Remove files specified by PURGE_TARGETS
#-- upx:       Compress binary executable files using UPX
#
OPTIONS=(strip docs libtool emptydirs zipman purge !upx)

#-- File integrity checks to use. Valid: md5, sha1, sha256, sha384, sha512
INTEGRITY_CHECK=(md5)
#-- Options to be used when stripping binaries. See `man strip' for details.
STRIP_BINARIES="--strip-all"
#-- Options to be used when stripping shared libraries. See `man strip' for details.
STRIP_SHARED="--strip-unneeded"
#-- Options to be used when stripping static libraries. See `man strip' for details.
STRIP_STATIC="--strip-debug"
#-- Manual (man and info) directories to compress (if zipman is specified)
MAN_DIRS=({usr{,/local}{,/share},opt/*}/{man,info})
#-- Doc directories to remove (if !docs is specified)
DOC_DIRS=(usr/{,local/}{,share/}{doc,gtk-doc} opt/*/{doc,gtk-doc})
#-- Files to be removed from all packages (if purge is specified)
PURGE_TARGETS=(usr/{,share}/info/dir .packlist *.pod)

#########################################################################
# PACKAGE OUTPUT
#########################################################################
#
# Default: put built package and cached source in build directory
#
#-- Destination: specify a fixed directory where all packages will be placed
#PKGDEST=/home/packages
#-- Source cache: specify a fixed directory where source files will be cached
#SRCDEST=/home/sources
#-- Source packages: specify a fixed directory where all src packages will be placed
#SRCPKGDEST=/home/srcpackages
#-- Packager: name/email of the person or organization building packages
#PACKAGER="John Doe <john@doe.com>"
#-- Specify a key to use for package signing
#GPGKEY=""

#########################################################################
# EXTENSION DEFAULTS
#########################################################################
#
# WARNING: Do NOT modify these variables unless you know what you are
#          doing.
#
PKGEXT='.pkg.tar.xz'
SRCEXT='.src.tar.gz'

# vim: set ft=sh ts=2 sw=2 et:
« Son Düzenleme: 01 Ocak 1970 - 02:00:00 Gönderen: Anonymous »

Çevrimdışı if*

  • İleti: 48
RE: Marlin FM kurulum sorunu (varka-bzr)
« Yanıtla #12 : 08 Nisan 2012 - 14:23:27 »
@krwlng, vaka-bzr paketiniderlediğiniz dizin neresi? Yâni
Kod: [Seç]
LC_ALL=C makepkg -s
komutunu verdiğiniz dizin?
« Son Düzenleme: 26 Nisan 2018 - 09:24:03 Gönderen: Sistem »

Çevrimdışı krwlng

  • Newbie
  • *
  • İleti: 54
Cvp: Marlin FM kurulum sorunu (varka-bzr)
« Yanıtla #13 : 08 Nisan 2012 - 14:59:36 »
@if, şimdi anladım dostum sağol, sırasıyla anlatayım konuyu kapatalım.



önce varka-bzr paketinin tarball arşivini indirip genel klasörüme açtım
Kod: [Seç]
LC_ALL=C makepkg -s
komutu ile paket dosyasını oluşturdum, sonra aynı dizinde
Kod: [Seç]
pacman -U --asdeps varka-bzr-7-1-x86_64.pkg.tar.xz
komutu ile varka-bzr derledim sorun çıkmadı.



Ardından aynı yolla marlin-bzr derledim, çünkü marlin-bzr derlerken de varka ile aynı sorunu aldım, marlini de derledikten sonra sorun kalmadı şuan marlin dosya yöneticisi çalışıyor, yardımcı olan arkadaşlara teşekkür ediyorum.



@tarakbumba,
Kod: [Seç]
pacman -U --asdeps varka-bzr
komutunda varka-bzr için dosya uzantısını yazmadığım için hata veriyormuş, paketlediğim dosyanın uzantısı ile verince komutu sorun çözüldü.
« Son Düzenleme: 01 Ocak 1970 - 02:00:00 Gönderen: Anonymous »

Çevrimdışı cumali

  • Administrator
  • *****
  • İleti: 2.228
RE: Marlin FM kurulum sorunu (varka-bzr)
« Yanıtla #14 : 08 Nisan 2012 - 16:43:23 »
Sorunu çözebilmiş olmana sevindim. Geri bildirim içinde ayrıca teşekkür ederim.Konu başlığına çözüldü ekleyip şimdilik konuyu açık tutuyorum.
« Son Düzenleme: 01 Ocak 1970 - 02:00:00 Gönderen: Anonymous »